{"text_format":"1","workbook":"xlsx","n_sheets":11,"sheets":["Instructions","Références","Entrées","Bilan","Portée 1 - Procédés","Portée 1 - Combustion","Portée 2 - Électricité","Portée 3 - Électricité","Portée 3 - Combustibles","Portée 3 - Biosolides","Portée 3 - Produits chimiques"],"not_rendered":{"charts":4,"images":2,"macros":1,"external_links":0,"defined_names":72,"comments":4,"pivot_tables":0},"unopened":[],"bounds":{"document_bytes":16777216,"sheet_cells":100000,"rows_first":2000,"rows_last":500,"rows_between":2000,"halvings":0,"cell_chars":16384,"cell_head_chars":4096},"cells_cut":0,"cells_raw":0,"read":"whole","date_system":"1900"}

{"sheet":"Instructions","index":0,"n_rows":60,"n_cols":4,"rows_kept":60,"cut":false,"hidden":false,"merged":[[18,12,18,22],[19,12,19,22],[15,1,15,11],[3,1,3,11],[14,1,14,11],[18,1,18,11],[19,1,19,11]]}
[null,"Inventaire des émissions de gaz à effet de serre"]
[]
[null,"À propos : "]
[null,"L’outil d’inventaire des émissions de gaz à effet de serre (outil d’inventaire des GES) a été conçu comme un outil gratuit et accessible pour aider les services publics à élaborer un inventaire des émissions de GES le plus précis possible. Il est basé sur le travail effectué par l’Université de Toronto sous contrat avec la Ville de Toronto, tel que révisé par le groupe de travail sur l’inventaire des GES du comité mixte sur les changements climatiques de l’OWWA/WEAO. Cet outil a été conçu pour être utilisé par les services d’eau et d’eaux usées de l’Ontario, mais il peut être adapté à d’autres juridictions."]
[]
[null,"Versions"]
[null,"N° de version","Date de publication","Description"]
[null,"01","2023-03-10","Première version pour le test bêta"]
[null,"02","2023-04-17","Première publication officielle sur les sites de l’OWWA et de la WEAO"]
[null,"03","2023-09-14","Corrections et mises à jour mineures – changements résumés dans le Guide de l’utilisateur"]
{"$rows_left_out":51}
{"sheet":"Références","index":1,"n_rows":20,"n_cols":4,"rows_kept":20,"cut":false,"hidden":false,"merged":[]}
[null,"RÉFÉRENCES"]
[]
[null,"Les « noms courts » ci-dessous sont utilisés dans la feuille Excel pour retracer l’origine des données de la documentation. Les liens sont inclus sur cette page uniquement, pour faciliter les mises à jour futures.  "]
[]
[null,"Nom court","Nom complet","Lien (en anglais)"]
[null,"BEAM 2011","Modèle d’évaluation des émissions associées aux biosolides 2011","https://ccme.ca/fr/res/beam_fr_revised_version_1.1.xls"]
[null,"Guide de l’utilisateur du BEAM 2009","Guide de l’utilisateur du modèle d’évaluation des émissions associées aux biosolides 2011","https://www.ccme.ca/fr/res/meeb_guidef.pdf"]
[null,"Guide valorisation des biosolides 2012","Guide pour la valorisation des biosolides municipaux, des boues municipales et des boues de fosses septiques traitées 2012","https://www.environnement.gouv.qc.ca/matieres/articles/boues-municipales-pol.pdf"]
[null,"BEAM 2022","Biosolids Emissions Assessment Model 2022","https://www.biosolidsghgs.org/"]
[null,"Canada Fuel LCA Model 2024","Base de données du modèle ACV des combustibles du Canada 2024 juin 2024","https://www.canada.ca/fr/environnement-changement-climatique/services/gestion-pollution/modele-analyse-cycle-vie-combustibles.html"]
{"$rows_left_out":11}
{"sheet":"Entrées","index":2,"n_rows":307,"n_cols":32,"rows_kept":307,"cut":false,"hidden":false,"merged":[[241,1,242,1],[241,2,242,2],[237,2,238,2],[15,9,15,12],[15,4,15,7],[237,1,238,1],[94,4,94,6],[208,5,208,7],[23,1,24,1],[23,2,24,2],[11,3,11,5],[10,3,10,5],[9,3,9,5],[287,6,287,11],[288,6,288,11],[289,6,289,11],[290,6,290,11],[291,6,291,11],[292,6,292,11],[293,6,293,11],[294,6,294,11],[295,6,295,11],[296,6,296,11],[297,6,297,11],[298,6,298,11],[304,6,304,11],[305,6,305,11],[306,6,306,11],[299,6,299,11],[300,6,300,11],[301,6,301,11],[302,6,302,11],[303,6,303,11]]}
[null,"Inventaire des émissions de GES – Entrées ",null,null,null,null,null,null,null,null,null,null,null,null,null,null,null,null,"NE PAS SUPPRIMER OU MODIFIER LES CELLULES DANS LES COLONNES AU-DELÀ DE LA COLONNE ROUGE. ELLES SONT UTILISÉES COMME CALCULS INTERNES POUR LE FORMATAGE ET LES LISTES."]
[null,null,null,null,null,null,null,null,null,null,null,null,null,null,null,null,null,null,"LES COLONNES AU-DELÀ DE LA COLONNE ROUGE NE DOIVENT PAS ÊTRE IMPRIMÉES POUR LES SORTIES."]
[null,"LÉGENDE"]
[null,"Données spécifiques aux services publics"]
[null,"Valeur adoptée par le service public"]
[null,"Entrée par défaut, plage type ou valeur adaptée de la documentation"]
[null,"Rendement calculé sur la base de données spécifiques aux services publics"]
[]
[null,"DONNÉES SPÉCIFIQUES AUX SERVICES PUBLICS"]
[null,"Nom du service public"]
{"$rows_left_out":298}
{"sheet":"Bilan","index":3,"n_rows":95,"n_cols":20,"rows_kept":95,"cut":false,"hidden":false,"merged":[[16,1,17,1],[3,1,15,1],[18,1,27,1],[30,1,30,2],[42,5,42,8],[45,13,45,15],[50,9,50,12],[51,9,51,12],[51,13,51,15],[42,9,42,12],[45,9,45,12]]}
[null,"Inventaire des émissions de GES – Bilan",null,null,null,null,null,null,null,null,null,null,null,null,null,null,null,null,"NE PAS SUPPRIMER OU MODIFIER LES CELLULES DANS LES COLONNES AU-DELÀ DE LA COLONNE GRISE. ELLES SONT UTILISÉES COMME CALCULS INTERNES POUR LE FORMATAGE ET LES LISTES."]
[null,null,null,null,null,null,null,null,null,null,null,null,null,null,null,null,null,null,"LES COLONNES AU-DELÀ DE LA COLONNE GRISE NE DOIVENT PAS ÊTRE IMPRIMÉES POUR LES SORTIES."]
[null,"Détails des sources d'émission",null,"Unité","TOTAL",{"$f":"IF(WWTP1=\"\",\"\",WWTP1)","v":"STEU1"},{"$f":"IF(WWTP2=\"\",\"\",WWTP2)","v":"STEU2"},{"$f":"IF(WWTP3=\"\",\"\",WWTP3)","v":"STEU3"},{"$f":"IF(WWTP4=\"\",\"\",WWTP4)","v":"STEU4"},{"$f":"IF(WTP1_=\"\",\"\",WTP1_)","v":"STE1"},{"$f":"IF(WTP2_=\"\",\"\",WTP2_)","v":"STE2"},{"$f":"IF(WTP3_=\"\",\"\",WTP3_)","v":"STE3"},{"$f":"IF(WTP4_=\"\",\"\",WTP4_)","v":"STE4"},{"$f":"IF(WWCollection=\"\",\"\",WWCollection)","v":"Collecte"},{"$f":"IF(WDistr=\"\",\"\",WDistr)","v":"Distribution"},{"$f":"IF(SuppFac=\"\",\"\",SuppFac)","v":"Inst. sout."}]
[null,"Portée 1","Combustion du biogaz dans le digesteur ","tCO2éq./an",{"$f":"SUM(F4:Q4)","v":0},{"$f":"'Portée 1 - Combustion'!G47","v":0},{"$f":"'Portée 1 - Combustion'!H47","v":0},{"$f":"'Portée 1 - Combustion'!I47","v":0},{"$f":"'Portée 1 - Combustion'!J47","v":0}]
[null,null,"Incinération des boues de biosolides","tCO2éq./an",{"$f":"SUM(F5:Q5)","v":0},{"$f":"'Portée 1 - Combustion'!G68","v":""},{"$f":"'Portée 1 - Combustion'!H68","v":""},{"$f":"'Portée 1 - Combustion'!I68","v":""},{"$f":"'Portée 1 - Combustion'!J68","v":""}]
[null,null,"N2O provenant du traitement","tCO2éq./an",0,{"$f":"'Portée 1 - Procédés'!G144","v":0},{"$f":"'Portée 1 - Procédés'!H144","v":0},{"$f":"'Portée 1 - Procédés'!I144","v":0},{"$f":"'Portée 1 - Procédés'!J144","v":0}]
[null,null,"CH4 provenant du traitement","tCO2éq./an",0,{"$f":"'Portée 1 - Procédés'!G76","v":0},{"$f":"'Portée 1 - Procédés'!H76","v":0},{"$f":"'Portée 1 - Procédés'!I76","v":0},{"$f":"'Portée 1 - Procédés'!J76","v":0}]
[null,null,"N2O fugitif provenant du rejet d’effluents ","tCO2éq./an",0,{"$f":"'Portée 1 - Procédés'!G153","v":0},{"$f":"'Portée 1 - Procédés'!H153","v":0},{"$f":"'Portée 1 - Procédés'!I153","v":0},{"$f":"'Portée 1 - Procédés'!J153","v":0}]
[null,null,"CH4 fugitif du digesteur anaérobie ","tCO2éq./an",0,{"$f":"'Portée 1 - Procédés'!G112","v":0},{"$f":"'Portée 1 - Procédés'!H112","v":0},{"$f":"'Portée 1 - Procédés'!I112","v":0},{"$f":"'Portée 1 - Procédés'!J112","v":0}]
[null,null,"CH4 fugitif provenant du rejet d’effluent ","tCO2éq./an",0,{"$f":"'Portée 1 - Procédés'!G85","v":0},{"$f":"'Portée 1 - Procédés'!H85","v":0},{"$f":"'Portée 1 - Procédés'!I85","v":0},{"$f":"'Portée 1 - Procédés'!J85","v":0}]
{"$rows_left_out":86}
{"sheet":"Portée 1 - Procédés","index":4,"n_rows":156,"n_cols":14,"rows_kept":156,"cut":false,"hidden":false,"merged":[[11,2,11,3],[17,2,17,3],[35,2,35,3],[41,2,41,3],[74,2,75,2],[23,2,23,3],[78,2,78,3],[47,2,47,3],[83,3,84,3],[83,2,84,2],[74,3,75,3],[90,6,90,9],[125,2,125,3],[92,1,99,1],[98,3,99,3],[107,3,108,3],[101,2,101,3],[119,2,119,3],[107,2,108,2],[102,1,108,1],[92,2,92,3],[110,2,111,2],[110,3,111,3],[154,3,155,3],[151,3,152,3],[142,3,143,3],[131,2,131,3],[138,2,138,3],[146,2,146,3],[142,2,143,2],[151,2,152,2]]}
[null,"Portée 1 – Émissions de GES associées aux processus de traitement",null,null,null,null,null,null,null,null,null,null,"NE PAS SUPPRIMER OU MODIFIER LES CELLULES DANS LES COLONNES AU-DELÀ DE LA COLONNE VERTE. ELLES SONT UTILISÉES COMME CALCULS INTERNES POUR LE FORMATAGE ET LES LISTES."]
[null,null,null,null,null,null,null,null,null,null,null,null,"LES COLONNES AU-DELÀ DE LA COLONNE VERTE NE DOIVENT PAS ÊTRE IMPRIMÉES POUR LES SORTIES."]
[null,"POTENTIEL DE RÉCHAUFFEMENT PLANÉTAIRE"]
[null,null,null,"PRP du CH4 biogénique (horizon de 100 ans)","-",null,{"$f":"Entrées!$E$212","v":27},{"$f":"Entrées!$E$212","v":27},{"$f":"Entrées!$E$212","v":27},{"$f":"Entrées!$E$212","v":27},{"$f":"Entrées!$I$212","v":"AR4: IPCC 2007, Tableau 2.14, AR5: IPCC 2013, Tableau 8.7, AR6: IPCC 2021, Tableau 7.15"}]
[null,null,null,"PRP du N2O (horizon de 100 ans)","-",null,{"$f":"Entrées!$E$214","v":273},{"$f":"Entrées!$E$214","v":273},{"$f":"Entrées!$E$214","v":273},{"$f":"Entrées!$E$214","v":273},{"$f":"Entrées!$I$214","v":"AR4: IPCC 2007, Tableau 2.14, AR5: IPCC 2013, Tableau 8.7, AR6: IPCC 2021, Tableau 7.17"}]
[]
[null,"ÉMISSIONS DE MÉTHANE PROVENANT DES EAUX USÉES DOMESTIQUES"]
[null,"Méthodologie : Les cinq étapes suivantes ont été adaptées à partir du document 2019 Refinement of the IPCC Guidelines, volume 5, chapitres 4 et 6."]
[]
[null,"Étape 1 –","Estimer la quantité de matières organiques en kg de DBO/an dans l’influent des eaux usées, la dérivation et les effluents rejetés dans l’environnement aquatique"]
{"$rows_left_out":147}
{"sheet":"Portée 1 - Combustion","index":5,"n_rows":128,"n_cols":18,"rows_kept":128,"cut":false,"hidden":false,"merged":[[120,8,120,17],[13,10,13,17],[23,10,23,17],[39,10,39,17],[118,8,118,17],[119,8,119,17],[115,2,115,3],[116,5,116,7],[104,2,104,3],[71,2,71,3],[8,2,8,4],[21,2,21,4],[33,2,33,4],[93,2,93,3],[82,2,82,3],[50,2,50,3],[59,2,59,3]]}
[null,"Portée 1 – Émissions de GES associées à la combustion"]
[]
[null,"POTENTIEL DE RÉCHAUFFEMENT PLANÉTAIRE"]
[null,null,null,"PRP du CH4 biogénique (horizon de 100 ans)","-",null,{"$f":"Entrées!$E$212","v":27},{"$f":"Entrées!$E$212","v":27},{"$f":"Entrées!$E$212","v":27},{"$f":"Entrées!$E$212","v":27},{"$f":"Entrées!$I$212","v":"AR4: IPCC 2007, Tableau 2.14, AR5: IPCC 2013, Tableau 8.7, AR6: IPCC 2021, Tableau 7.15"}]
[null,null,null,"PRP du N2O (horizon de 100 ans)","-",null,{"$f":"Entrées!$E$214","v":273},{"$f":"Entrées!$E$214","v":273},{"$f":"Entrées!$E$214","v":273},{"$f":"Entrées!$E$214","v":273},{"$f":"Entrées!$I$214","v":"AR4: IPCC 2007, Tableau 2.14, AR5: IPCC 2013, Tableau 8.7, AR6: IPCC 2021, Tableau 7.17"}]
[]
[null,"ÉMISSIONS DE COMBUSTION DU BIOGAZ DU DIGESTEUR"]
[null,"Étape 1 –","Estimation des émissions de la combustion du gaz de digesteur dans les chaudières",null,null,null,null,null,null,null,"Notes/références de l’utilisateur"]
[null,null,"EDG,boiler  = ((1-εCH4 )* fCH4 * dboiler * VDG)*GWPCH4 + (EFN2O * dboiler * VDG)*GWPN2O",null,null,null,null,null,null,null,"Adapté de Méthodologie du modèle ACV des combustibles du Canada 2020, Annexe B, Étape clé 2, Annex D (pg. 295 du PDF) "]
[null,null,null,null,"Unité","TOTAL",{"$f":"IF(WWTP1=\"\",\"\",WWTP1)","v":"STEU1"},{"$f":"IF(WWTP2=\"\",\"\",WWTP2)","v":"STEU2"},{"$f":"IF(WWTP3=\"\",\"\",WWTP3)","v":"STEU3"},{"$f":"IF(WWTP4=\"\",\"\",WWTP4)","v":"STEU4"}]
{"$rows_left_out":119}
{"sheet":"Portée 2 - Électricité","index":6,"n_rows":9,"n_cols":18,"rows_kept":9,"cut":false,"hidden":false,"merged":[[4,2,4,3]]}
[null,"Portée 2 – Émissions de GES associées à la consommation d’électricité"]
[]
[null,"ÉMISSIONS DE LA CONSOMMATION D’ÉLECTRICITÉ"]
[null,"Étape 1 –","Estimer les émissions de la consommation d’électricité sur le site"]
[null,null,"Eelec = EFelec * Velec"]
[null,null,null,null,"Unit","TOTAL",{"$f":"IF(WWTP1=\"\",\"\",WWTP1)","v":"STEU1"},{"$f":"IF(WWTP2=\"\",\"\",WWTP2)","v":"STEU2"},{"$f":"IF(WWTP3=\"\",\"\",WWTP3)","v":"STEU3"},{"$f":"IF(WWTP4=\"\",\"\",WWTP4)","v":"STEU4"},{"$f":"IF(WWCollection=\"\",\"\",WWCollection)","v":"Collecte"},{"$f":"IF(WTP1_=\"\",\"\",WTP1_)","v":"STE1"},{"$f":"IF(WTP2_=\"\",\"\",WTP2_)","v":"STE2"},{"$f":"IF(WTP3_=\"\",\"\",WTP3_)","v":"STE3"},{"$f":"IF(WTP4_=\"\",\"\",WTP4_)","v":"STE4"},{"$f":"IF(WDistr=\"\",\"\",WDistr)","v":"Distribution"},{"$f":"IF(SuppFac=\"\",\"\",SuppFac)","v":"Inst. sout."},"Notes/références de l’utilisateur"]
[null,null,"EFelec","CE de la consommation d’électricité en Ontario","gCO2éq/kWh",null,{"$f":"Entrées!$E$279","v":35},{"$f":"Entrées!$E$279","v":35},{"$f":"Entrées!$E$279","v":35},{"$f":"Entrées!$E$279","v":35},{"$f":"Entrées!$E$279","v":35},{"$f":"Entrées!$E$279","v":35},{"$f":"Entrées!$E$279","v":35},{"$f":"Entrées!$E$279","v":35},{"$f":"Entrées!$E$279","v":35},{"$f":"Entrées!$E$279","v":35},{"$f":"Entrées!$E$279","v":35},{"$f":"Entrées!G279","v":"NIR 2024, Partie 3, Tableau A13-7"}]
[null,null,"Velec","Consommation annuelle d’électricité","kWh/an",null,{"$f":"Entrées!E89","v":0},{"$f":"Entrées!F89","v":0},{"$f":"Entrées!G89","v":0},{"$f":"Entrées!H89","v":0},{"$f":"Entrées!I89","v":0},{"$f":"Entrées!J89","v":0},{"$f":"Entrées!K89","v":0},{"$f":"Entrées!L89","v":0},{"$f":"Entrées!M89","v":0},{"$f":"Entrées!N89","v":0},{"$f":"Entrées!O89","v":0},{"$f":"Entrées!Q89","v":0}]
[null,null,"Eelec","Émissions de la consommation d’électricité","tCO2éq/an",{"$f":"SUM(G9:Q9)","v":0},{"$f":"G8*G7/1000000","v":0},0,0,0,0,0,0,0,0,0,0]

{"sheet":"Portée 3 - Électricité","index":7,"n_rows":11,"n_cols":18,"rows_kept":11,"cut":false,"hidden":false,"merged":[[4,2,4,3]]}
[null,"Portée 3 – Émissions de GES associées à l’électricité"]
[]
[null,"ÉMISSIONS DE L’ÉLECTRICITÉ – PORTÉE 3 – Utilisation du modèle d’ACV du secteur de l’électricité – Inventaire national "]
[null,"Étape 1 –","Estimer les émissions de la Portée 3 associées à l’électricité "]
[null,null,"Eup-elec = EFup-elec * Velec"]
[null,null,null,null,"Unit","TOTAL",{"$f":"IF(WWTP1=\"\",\"\",WWTP1)","v":"STEU1"},{"$f":"IF(WWTP2=\"\",\"\",WWTP2)","v":"STEU2"},{"$f":"IF(WWTP3=\"\",\"\",WWTP3)","v":"STEU3"},{"$f":"IF(WWTP4=\"\",\"\",WWTP4)","v":"STEU4"},{"$f":"IF(WWCollection=\"\",\"\",WWCollection)","v":"Collecte"},{"$f":"IF(WTP1_=\"\",\"\",WTP1_)","v":"STE1"},{"$f":"IF(WTP2_=\"\",\"\",WTP2_)","v":"STE2"},{"$f":"IF(WTP3_=\"\",\"\",WTP3_)","v":"STE3"},{"$f":"IF(WTP4_=\"\",\"\",WTP4_)","v":"STE4"},{"$f":"IF(WDistr=\"\",\"\",WDistr)","v":"Distribution"},{"$f":"IF(SuppFac=\"\",\"\",SuppFac)","v":"Inst. sout."},"Notes/références de l’utilisateur"]
[null,null,"EFelec","CE de l’intensité de la production d’électricité en Ontario","gCO2éq/kWh",null,{"$f":"Entrées!$E$279","v":35},{"$f":"Entrées!$E$279","v":35},{"$f":"Entrées!$E$279","v":35},{"$f":"Entrées!$E$279","v":35},{"$f":"Entrées!$E$279","v":35},{"$f":"Entrées!$E$279","v":35},{"$f":"Entrées!$E$279","v":35},{"$f":"Entrées!$E$279","v":35},{"$f":"Entrées!$E$279","v":35},{"$f":"Entrées!$E$279","v":35},{"$f":"Entrées!$E$279","v":35},{"$f":"Entrées!G279","v":"NIR 2024, Partie 3, Tableau A13-7"}]
[null,null,null,"CE du réseau basé sur l’ACV de l’Ontario","gCO2éq/kWh",null,{"$f":"Entrées!$E$280","v":42.280169999999998},{"$f":"Entrées!$E$280","v":42.280169999999998},{"$f":"Entrées!$E$280","v":42.280169999999998},{"$f":"Entrées!$E$280","v":42.280169999999998},{"$f":"Entrées!$E$280","v":42.280169999999998},{"$f":"Entrées!$E$280","v":42.280169999999998},{"$f":"Entrées!$E$280","v":42.280169999999998},{"$f":"Entrées!$E$280","v":42.280169999999998},{"$f":"Entrées!$E$280","v":42.280169999999998},{"$f":"Entrées!$E$280","v":42.280169999999998},{"$f":"Entrées!$E$280","v":42.280169999999998},{"$f":"Entrées!G280","v":"Canada Fuel LCA Model 2024"}]
[null,null,"EFup-elec","CE de l’électricité de la Portée 3 de l’Ontario ","gCO2éq/kWh",null,{"$f":"G8-G7","v":7.2801699999999983},7.2801699999999983,7.2801699999999983,7.2801699999999983,7.2801699999999983,7.2801699999999983,7.2801699999999983,7.2801699999999983,7.2801699999999983,7.2801699999999983,7.2801699999999983]
[null,null,"Velec","Consommation annuelle d’électricité","kWh/an",null,{"$f":"Entrées!E89","v":0},{"$f":"Entrées!F89","v":0},{"$f":"Entrées!G89","v":0},{"$f":"Entrées!H89","v":0},{"$f":"Entrées!I89","v":0},{"$f":"Entrées!J89","v":0},{"$f":"Entrées!K89","v":0},{"$f":"Entrées!L89","v":0},{"$f":"Entrées!M89","v":0},{"$f":"Entrées!N89","v":0},{"$f":"Entrées!O89","v":0},{"$f":"Entrées!Q89","v":0}]
{"$rows_left_out":2}
{"sheet":"Portée 3 - Combustibles","index":8,"n_rows":54,"n_cols":18,"rows_kept":54,"cut":false,"hidden":false,"merged":[[4,2,4,3],[13,2,13,3],[31,2,31,3],[46,8,46,17],[47,8,47,17],[43,2,43,3],[44,5,44,7],[22,2,22,3]]}
[null,"Portée 3 – Émissions de GES en amont associées au combustible"]
[]
[null,"ÉMISSIONS EN AMONT DU GAZ NATUREL"]
[null,"Étape 1 –","Estimation des émissions en amont du gaz naturel",null,null,null,null,null,null,null,null,null,null,null,null,null,null,"Notes/références de l’utilisateur"]
[null,null,"U NG = EFu * HHV * VNG",null,null,null,null,null,null,null,null,null,null,null,null,null,null,"Adapté de MECP ON.20"]
[null,null,null,null,"Unité","TOTAL",{"$f":"IF(WWTP1=\"\",\"\",WWTP1)","v":"STEU1"},{"$f":"IF(WWTP2=\"\",\"\",WWTP2)","v":"STEU2"},{"$f":"IF(WWTP3=\"\",\"\",WWTP3)","v":"STEU3"},{"$f":"IF(WWTP4=\"\",\"\",WWTP4)","v":"STEU4"},{"$f":"IF(WWCollection=\"\",\"\",WWCollection)","v":"Collecte"},{"$f":"IF(WTP1_=\"\",\"\",WTP1_)","v":"STE1"},{"$f":"IF(WTP2_=\"\",\"\",WTP2_)","v":"STE2"},{"$f":"IF(WTP3_=\"\",\"\",WTP3_)","v":"STE3"},{"$f":"IF(WTP4_=\"\",\"\",WTP4_)","v":"STE4"},{"$f":"IF(WDistr=\"\",\"\",WDistr)","v":"Distribution"},{"$f":"IF(SuppFac=\"\",\"\",SuppFac)","v":"Inst. sout."}]
[null,null,"HHVNG","Pouvoir calorifique supérieur du gaz naturel","GJ/m3",null,{"$f":"Entrées!$E$254","v":3.7999999999999999E-2},{"$f":"Entrées!$E$254","v":3.7999999999999999E-2},{"$f":"Entrées!$E$254","v":3.7999999999999999E-2},{"$f":"Entrées!$E$254","v":3.7999999999999999E-2},{"$f":"Entrées!$E$254","v":3.7999999999999999E-2},{"$f":"Entrées!$E$254","v":3.7999999999999999E-2},{"$f":"Entrées!$E$254","v":3.7999999999999999E-2},{"$f":"Entrées!$E$254","v":3.7999999999999999E-2},{"$f":"Entrées!$E$254","v":3.7999999999999999E-2},{"$f":"Entrées!$E$254","v":3.7999999999999999E-2},{"$f":"Entrées!$E$254","v":3.7999999999999999E-2},{"$f":"Entrées!G254","v":"MECP ON.20, 2019, Table 20-1, page 96"}]
[null,null,"EFu","Intensité carbone du gaz naturel – du berceau au consommateur (CTCG)","gCO2éq/MJ",null,{"$f":"Entrées!$E$255","v":15},{"$f":"Entrées!$E$255","v":15},{"$f":"Entrées!$E$255","v":15},{"$f":"Entrées!$E$255","v":15},{"$f":"Entrées!$E$255","v":15},{"$f":"Entrées!$E$255","v":15},{"$f":"Entrées!$E$255","v":15},{"$f":"Entrées!$E$255","v":15},{"$f":"Entrées!$E$255","v":15},{"$f":"Entrées!$E$255","v":15},{"$f":"Entrées!$E$255","v":15},{"$f":"Entrées!G255","v":"Canada Fuel LCA Methodology 2020, Annexe B, Tableau 1 (p.129 du PDF)"}]
[null,null,"VNG","Consommation annuelle de gaz naturel","m3/an",null,{"$f":"Entrées!E78","v":0},{"$f":"Entrées!F78","v":0},{"$f":"Entrées!G78","v":0},{"$f":"Entrées!H78","v":0},{"$f":"Entrées!I78","v":0},{"$f":"Entrées!J78","v":0},{"$f":"Entrées!K78","v":0},{"$f":"Entrées!L78","v":0},{"$f":"Entrées!M78","v":0},{"$f":"Entrées!N78","v":0},{"$f":"Entrées!O78","v":0},{"$f":"Entrées!Q78","v":0}]
[null,null,"UNG","Émissions en amont du gaz naturel","tCO2éq./an",{"$f":"SUM(G10:Q10)","v":0},{"$f":"G7*G9*G8/1000","v":0},{"$f":"H7*H9*H8/1000","v":0},0,0,0,0,0,0,0,0,0]
{"$rows_left_out":45}
{"sheet":"Portée 3 - Biosolides","index":9,"n_rows":22,"n_cols":10,"rows_kept":22,"cut":false,"hidden":false,"merged":[[4,6,4,8]]}
[null,"Portée 3 – Émissions de GES associées à la gestion des biosolides"]
[]
[null,"ÉMISSIONS LIÉES À LA GESTION DES BIOSOLIDES HORS SITE"]
[null,"Étape 1 –","Choisir une méthode d’inventaire pour les biosolides"]
[null,null,"Approche d’inventaire pour les biosolides",null,null,null,{"$f":"Entrées!$E$95","v":"BEAM 2011"}]
[]
[null,"Étape 2 –","Estimer les émissions associées à la gestion des biosolides (BEAM)"]
[null,null,null,"Unité de procédé",null,null,{"$f":"IF(WWTP1=\"\",\"\",WWTP1)","v":"STEU1"},{"$f":"IF(WWTP2=\"\",\"\",WWTP2)","v":"STEU2"},{"$f":"IF(WWTP3=\"\",\"\",WWTP3)","v":"STEU3"},{"$f":"IF(WWTP4=\"\",\"\",WWTP4)","v":"STEU4"}]
[null,null,null,"Stabilisation alcaline","tCO2éq./an",null,{"$f":"IF($G$5=Entrées!$T$94,Entrées!E99,IF($G$5=Entrées!$T$95,Entrées!E108,\"\"))","v":0},{"$f":"IF($G$5=Entrées!$T$94,Entrées!F99,IF($G$5=Entrées!$T$95,Entrées!F108,\"\"))","v":0},{"$f":"IF($G$5=Entrées!$T$94,Entrées!G99,IF($G$5=Entrées!$T$95,Entrées!G108,\"\"))","v":0},{"$f":"IF($G$5=Entrées!$T$94,Entrées!H99,IF($G$5=Entrées!$T$95,Entrées!H108,\"\"))","v":0}]
[null,null,null,"Compostage","tCO2éq./an",null,{"$f":"IF($G$5=Entrées!$T$94,Entrées!E100,IF($G$5=Entrées!$T$95,Entrées!E109,\"\"))","v":0},{"$f":"IF($G$5=Entrées!$T$94,Entrées!F100,IF($G$5=Entrées!$T$95,Entrées!F109,\"\"))","v":0},{"$f":"IF($G$5=Entrées!$T$94,Entrées!G100,IF($G$5=Entrées!$T$95,Entrées!G109,\"\"))","v":0},{"$f":"IF($G$5=Entrées!$T$94,Entrées!H100,IF($G$5=Entrées!$T$95,Entrées!H109,\"\"))","v":0}]
{"$rows_left_out":13}
{"sheet":"Portée 3 - Produits chimiques","index":10,"n_rows":166,"n_cols":19,"rows_kept":166,"cut":false,"hidden":false,"merged":[[5,2,5,3],[74,2,74,3]]}
[null,"Portée 3 – Émissions de GES associées à la consommation de produits chimiques",null,null,null,null,null,null,null,null,null,null,null,null,null,null,null,null,"NE PAS SUPPRIMER OU MODIFIER LES CELLULES DANS LES COLONNES AU-DELÀ DE LA COLONNE BLEUE. ELLES SONT UTILISÉES COMME CALCULS INTERNES POUR LE FORMATAGE ET LES LISTES."]
[null,null,null,null,null,null,null,null,null,null,null,null,null,null,null,null,null,null,"LES COLONNES AU-DELÀ DE LA COLONNE BLEUE NE DOIVENT PAS ÊTRE IMPRIMÉES POUR LES SORTIES."]
[null,"Remarque :","Veuillez vous référer au Guide de l’utilisateur pour obtenir des conseils sur les approches permettant d’estimer les émissions des produits chimiques."]
[null,"ÉMISSIONS DE LA CONSOMMATION DE PRODUITS CHIMIQUES"]
[null,"Étape 1 –","Estimer les émissions associées à la production de produits chimiques",null,null,null,null,null,null,null,null,null,null,null,null,null,null,null,{"$f":"TRUE","v":true}]
[null,null,"Echem = EFchem * Mchem",null,null,null,null,null,null,null,null,null,null,null,null,null,null,null,{"$f":"TRUE","v":true}]
[null,null,null,null,"Unité","Valeur de l’entrée","Notes/références de l’utilisateur",null,null,null,null,null,null,null,null,null,null,null,{"$f":"TRUE","v":true}]
[null,null,"EFchem","CE des émissions de produits chimiques"]
[null,null,null,{"$f":"Entrées!C124","v":"Produit chimique 1"},"kgCO2éq./kg",{"$f":"Entrées!E288","v":0},{"$f":"Entrées!G288","v":0},null,null,null,null,null,null,null,null,null,null,null,{"$f":"Entrées!T124","v":false}]
[null,null,null,{"$f":"Entrées!C125","v":"Produit chimique 2"},"kgCO2éq./kg",{"$f":"Entrées!E289","v":0},{"$f":"Entrées!G289","v":0},null,null,null,null,null,null,null,null,null,null,null,{"$f":"Entrées!T125","v":false}]
{"$rows_left_out":156}